{"text_format":"3","workbook":"xlsx","n_sheets":24,"sheets":["FFGym Clubs","Evolution Tumbling avant","Evolution Tumbling arrière","Détente Tumbling Mixte","Evolution MT - MT","Découverte Tumbling avant","Découverte Tumbling arrière","Détente Tumbling avant","Détente Tumbling arrière","Découverte MT - MT","Détente MT - Saut","ListeDiffSol","Détente MT - MT","ListeClubs 95 ","liste","Activer Macro 97-2003","Activer Macro2007","SOL Explications","Explications","fiche engagement","FED Dif Sol","PERF Dif Sol","dif tumbling","dif mini tramp"],"not_rendered":{"images":11,"macros":1,"external_links":1,"defined_names":43},"read":"whole","date_system":"1900"}

{"sheet":"FFGym Clubs","index":0,"n_rows":257,"n_cols":4,"rows_kept":257,"hidden":true}
["Nom","Number","Numéro d'affiliation","Ville"]
[null,0]
["1-CLUB INTROUVABLE ",1,"00000.000","INCONNUE"]
["A S C A",2,"52072.054","LA CHAPELLE ST-AUBIN"]
["A S COURONNAISE ",3,"28076.027","PETIT COURONNE"]
["A.S.P.C. GYM'SPORT",4,"52049.082","LES PONTS DE CE"]
["ABBEVILLE GYM",5,"32080.065","ABBEVILLE"]
["AC CHAPELAIN",6,"52044.061","LA CHAPELLE SUR ERDRE"]
["ACR GYM",7,"24041.061","ROMORANTIN"]
["ACRO TRAMP SAINT MAXIMIN SEILLONS",8,"93083.110","SAINT MAXIMIN LA SAINTE BAUME - SEILLONS "]
["ACRO VOLTIGE",9,"52085.103","LUCON"]
["AERO GYM BRIE",10,"11077.178","BRIE COMTE ROBERT"]
["AGM GYM VESOUL",11,"27070.055","VESOUL"]
["ALBONAISE GYMNASTIQUE DE FRANCONVILLE",12,"11095.301","FRANCONVILLE"]
["ALLIANCE TOURQUENNOISE DE GYMNASTIQUE",13,"32059.254","TOURCOING"]
["AMICALE LAIQUE IRIGNY",14,"84069.189","IRIGNY"]
["AMICALE LAIQUE JEUNES FILLES DE ROANNE",15,"84042.014","ROANNE"]
["AMICALE LAIQUE JULES FERRY",16,"84001.021","AMBERIEU EN BUGEY"]
["AMICALE LAIQUE P.BROSSOLETTE VANDOEUVRE",17,"44054.009","VANDOEUVRE"]
["AMICALE LAÏQUE REDON",18,"53035.001","REDON"]
{"$rows_left_out":238}
{"sheet":"Evolution Tumbling avant","index":1,"n_rows":14,"n_cols":3,"rows_kept":14,"hidden":true,"merged":[[0,0,0,2],[2,0,8,0],[9,0,12,0]]}
["Séries autorisées au Tumbling en avant\nTeamGym"]
[null,"Séries","Valeur"]
[null,"Roulade avant",0.3]
[null,"Roue",0.5]
[null,"Roue Rondade",0.5]
[null,"Roue Roue pied pied",0.5]
[null,"Roue saut de mains",1.5]
[null,"Saut de mains",1.5]
[null,"Saut de mains 1 pied",1.5]
[null,"Saut de mains 1 pied Roue",1.5]
[null,"Saut de mains 1 pied Rondade",1.5]
[null,"Saut de mains 1 pied Saut de mains",1.5]
[null,"Salto av groupé",2]
[null,"Série Nulle",0]

{"sheet":"Evolution Tumbling arrière","index":2,"n_rows":42,"n_cols":8,"rows_kept":42,"hidden":true,"merged":[[0,0,0,2],[2,0,4,0],[5,0,11,0]]}
["Séries autorisée au Tumbling en arrière\nTeamGym"]
[null,"Séries","Valeur"]
[null,"Roue",0.5]
[null,"Roue pied pied",0.5]
[null,"Roue Roue pied pied",0.5]
[null,"Roue saut de mains",0.5]
[null,"Saut de mains 1 pied Roue",0.5]
[null,"Rondade",1]
[null,"Roue Rondade",1]
[null,"Saut de mains 1 pied Rondade",1]
[null,"Rondade flip",1.5]
[null,"Rondade salto groupé",2]
[null,"Série Nulle ",0]
{"$rows_empty":13}
[{"$nulls":7},0]
{"$rows_empty":10}
[{"$nulls":7},0]
[{"$nulls":7},0]
[{"$nulls":7},0]
[{"$nulls":7},0]
{"$rows_left_out":2}
{"sheet":"Détente Tumbling Mixte","index":3,"n_rows":122,"n_cols":3,"rows_kept":122,"hidden":true,"merged":[[0,0,0,2],[2,0,17,0],[18,0,34,0],[35,0,39,0],[40,0,52,0]]}
["Séries autorisée au Tumbling en arrière\nTeamGym"]
[null,"Séries","Valeur"]
[null,"Saut de mains 1 pied Roue ",0.5]
[null,"Saut de mains 1 pied Rondade",0.5]
[null,"Roue Roue pied pied ",0.5]
[null,"Roue saut de mains ",0.5]
[null,"Roue Rondade",0.5]
[null,"Roue Roue pied pied",0.5]
[null,"Salto av décalé groupé Rondade  ",0.6]
[null,"Salto av décalé carpé Rondade  ",0.7]
[null,"Rondade flip ",1]
[null,"Roue saut de mains",1]
[null,"Saut de mains 1 pied Rondade",1]
[null,"Saut de mains 1 pied Roue",1]
[null,"Saut de mains 1 pied Saut de mains",1]
[null,"Salto av décalé groupé Rondade flip ",1.1]
[null,"Salto av décalé carpé Rondade flip ",1.2]
[null,"Flip av saut de mains",1.2]
["3 éléments","Saut de mains flip av ",1.2]
[null,"Rondade salto groupé ",1.4]
{"$rows_left_out":103}
{"sheet":"Evolution MT - MT","index":4,"n_rows":13,"n_cols":3,"rows_kept":13,"hidden":true,"merged":[[0,0,0,2],[2,0,11,0]]}
["Séries autorisées au Mini Trampoline et Table de Saut\nTeamGym"]
[null,"Eléments","Valeur "]
[null,"Saut groupé",1]
[null,"Saut droit",1]
[null,"Saut droit 1/2 tour",1.2]
[null,"Saut carpé serré",1.3]
[null,"Saut carpé écart",1.3]
[null,"Saut droit 1 tour",1.4]
[null,"Saut carpé écart 1/2 tour",1.5]
[null,"Salto av groupé",1.8]
[null,"Salto av carpé",1.9]
[null,"Salto av tendu",2]
[null,"Passage Nul",0]

{"sheet":"Découverte Tumbling avant","index":5,"n_rows":12,"n_cols":3,"rows_kept":12,"hidden":true,"merged":[[0,0,0,2],[2,0,8,0],[9,0,10,0]]}
["Séries autorisées au Tumbling en avant\nTeamGym"]
[null,"Séries","Valeur"]
[null,"Roulade avant",0.5]
[null,"Roue",1]
[null,"Roue Roue pied pied",1]
[null,"Roue saut de mains",2]
[null,"Saut de mains",2]
[null,"Saut de mains 1 pied",2]
[null,"Saut de mains 1 pied Rondade",2]
[null,"Saut de mains 1 pied Roue",2]
[null,"Saut de mains 1 pied Saut de mains",2]
[null,"Série Nulle",0]

{"sheet":"Découverte Tumbling arrière","index":6,"n_rows":41,"n_cols":8,"rows_kept":41,"hidden":true,"merged":[[0,0,0,2],[2,0,4,0],[5,0,10,0]]}
["Séries autorisée au Tumbling en arrière\nTeamGym"]
[null,"Séries","Valeur"]
[null,"Roue",1]
[null,"Roue pied pied",1]
[null,"Roue Roue pied pied",1]
[null,"Roue saut de mains",1]
[null,"Saut de mains 1 pied Roue",1]
[null,"Rondade",1.5]
[null,"Roue Rondade",1.5]
[null,"Saut de mains 1 pied Rondade",1.5]
[null,"Rondade flip",2]
[null,"Série Nulle ",0]
{"$rows_empty":13}
[{"$nulls":7},0]
{"$rows_empty":10}
[{"$nulls":7},0]
[{"$nulls":7},0]
[{"$nulls":7},0]
[{"$nulls":7},0]
[{"$nulls":7},0]
{"$rows_left_out":1}
{"sheet":"Détente Tumbling avant","index":7,"n_rows":71,"n_cols":3,"rows_kept":71,"hidden":true,"merged":[[0,0,0,2],[2,0,32,0],[33,0,53,0],[54,0,65,0],[66,0,67,0]]}
["Séries autorisées au Tumbling en avant\nTeamGym"]
[null,"Séries","Valeur"]
[null,"Roue Rondade",0.5]
[null,"Roue Roue pied pied",0.5]
[null,"Roue saut de mains",1]
[null,"Saut de mains 1 pied Rondade",1]
[null,"Saut de mains 1 pied Roue",1]
[null,"Saut de mains 1 pied Saut de mains",1]
[null,"Flip av saut de mains",1.2]
[null,"Saut de mains flip av ",1.2]
[null,"Salto av décalé groupé Rondade  ",1.4]
[null,"Salto av décalé groupé roue  ",1.4]
[null,"Salto av décalé groupé saut de mains ",1.4]
[null,"Salto av décalé carpé Rondade  ",1.5]
[null,"Salto av décalé carpé saut de mains ",1.5]
[null,"Saut de mains 1 pied Saut de mains salto groupé ",1.6]
[null,"Saut de mains salto av groupé",1.6]
[null,"Salto av carpé salto av groupé ",1.7]
[null,"Salto av décalé groupé saut de mains salto groupé ",1.7]
[null,"Salto av groupé salto carpé ",1.7]
{"$rows_left_out":52}
{"sheet":"Détente Tumbling arrière","index":8,"n_rows":55,"n_cols":3,"rows_kept":55,"hidden":true,"merged":[[0,0,0,2],[2,0,17,0],[18,0,38,0],[39,0,43,0],[44,0,51,0]]}
["Séries autorisée au Tumbling en arrière\nTeamGym"]
[null,"Séries","Valeur"]
["2 éléments","Saut de mains 1 pied Roue ",0.5]
[null,"Saut de mains 1 pied Rondade",0.5]
[null,"Roue Roue pied pied ",0.5]
[null,"Roue saut de mains ",0.5]
[null,"Roue Rondade ",0.5]
[null,"Salto av décalé groupé Rondade  ",0.6]
[null,"Salto av décalé carpé Rondade  ",0.7]
[null,"Rondade flip ",1]
[null,"Salto av décalé groupé Rondade  flip ",1.1]
[null,"Salto av décalé carpé Rondade  flip ",1.2]
[null,"Rondade salto groupé ",1.4]
[null,"Rondade flip salto groupé ",1.4]
[null,"Rondade salto carpé ",1.5]
[null,"Rondade flip salto carpé ",1.5]
[null,"Salto av décalé groupé Rondade  flip salto groupé ",1.5]
[null,"Salto av décalé groupé Rondade  Salto groupé ",1.5]
["3 éléments","Rondade salto groupé 180° ",1.6]
[null,"Rondade salto tendu ",1.6]
{"$rows_left_out":36}
{"sheet":"Découverte MT - MT","index":9,"n_rows":11,"n_cols":3,"rows_kept":11,"hidden":true,"merged":[[0,0,0,2],[2,0,9,0]]}
["Séries autorisées au Mini Trampoline et Table de Saut\nTeamGym"]
[null,"Eléments","Valeur "]
[null,"Saut droit",1.2]
[null,"Saut droit 1/2 tour",1.4]
[null,"Saut droit 1 tour",1.6]
[null,"Saut groupé",1.5]
[null,"Saut carpé serré",1.8]
[null,"Saut carpé écart",1.8]
[null,"Saut carpé écart 1/2 tour",2]
[null,"Salto av groupé",2]
[null,"Passage Nul",0]

{"sheet":"Détente MT - Saut","index":10,"n_rows":8,"n_cols":3,"rows_kept":8,"hidden":true,"merged":[[0,0,0,2],[2,0,8,0]]}
["Séries autorisées au Mini Trampoline et Table de Saut\nTeamGym"]
[null,"Eléments","Valeur"]
[null,"Rondade ",1]
[null,"Rondade 1/2 tour - Pétrick (180°/180°) ",1.2]
[null,"Lune ",1.6]
[null,"Lune 1/2 tour ",1.8]
[null,"Lune 1 vrille ",2]
[null,"Saut Nul",0]

{"sheet":"ListeDiffSol","index":11,"n_rows":147,"n_cols":11,"rows_kept":147,"hidden":true,"merged":[[0,0,0,3],[0,6,0,9]]}
["Fédérale",{"$nulls":5},"Performance"]
[]
["Saut","Pivots","Maintien","Elément de force","Mixte","Combi","Saut","Pivots","Maintien","Elément de force","Mixte"]
[]
["S201","P201","M204",null,"S201","S201","S201","P201","M601","EF1005","S201"]
["S202","P202","M206",null,"S202","S401","S401","P401","M1001","EF1206","S401"]
["S204","P401","M402",null,"S204","S601","S601","P601","M1201","EF1407","S601"]
["S210","P402","M404",null,"S210","S1001","S1001","P801","M402","EF1408","S1001"]
["S211","P403","M406",null,"S211","S1201","S1201","P1201","M1002","EF1608","S1201"]
["S214",null,"MM201",null,"S214","S202","S202","P202","M1202","EF809","S202"]
["S215",null,"MM202",null,"S215","S602","S602","P402","M603","EF810","S602"]
["S220",null,"MM204",null,"S220","S1002","S1002","P602","M1003","EF1210","S1002"]
["S401",null,"MM206",null,"S401","S1202","S1202","P802","M204","EF1610","S1202"]
["S403",null,"MM207",null,"S403","S403","S403","P1202","M404","EF1211","S403"]
["S406",null,"MM208",null,"S406","S603","S603","P403","M604","EF1411","S603"]
["S409",null,"MM402",null,"S409","S803","S803","P803","M1001","EF1611","S803"]
["S410",null,"MM403",null,"S410","S204","S204","P1003","M1204","EF812","S204"]
["S411",null,"MM404",null,"S411","S604","S604","P604","M605","EF1012","S604"]
["S412",null,"MM405",null,"S412","S804","S804","P1004","M805","EF1412","S804"]
["S415",{"$nulls":3},"S415","S1004","S1004","P1204","M206","EF1013","S1004"]
{"$rows_left_out":128}
{"sheet":"Détente MT - MT","index":12,"n_rows":15,"n_cols":3,"rows_kept":15,"hidden":true,"merged":[[0,0,0,2],[2,0,15,0]]}
["Séries autorisées au Mini Trampoline et Table de Saut\nTeamGym"]
[null,"Eléments","Valeur"]
[null,"Saut carpé ecart ",1]
[null,"Saut carpé ecart 1/2 tour ",1.2]
[null,"Salto av groupé ",1.4]
[null,"Salto av groupé 1/2 vrille ",1.6]
[null,"Salto av groupé 1 vrille ",1.8]
[null,"Salto av groupé 1 vrille 1/2 ",2]
[null,"Salto av carpé ",1.5]
[null,"Salto av carpé 1/2 vrille ",1.7]
[null,"Salto av tendu ",1.6]
[null,"Salto av tendu 1/2 vrille",1.8]
[null,"Salto av tendu 1 vrille ",2]
[null,"Salto av tendu 1 vrille 1/2 ",2]
[null,"Passage Nul",0]

{"sheet":"ListeClubs 95 ","index":13,"n_rows":191,"n_cols":6,"rows_kept":191,"hidden":true}
["Nom","Numéro d'affiliation","Abréviation","Région","Département","Ville"]
["UNION KOENIGSHOFFEN","01067.077","UNION KOENIGSHOFFEN","ALSACE","BAS RHIN","KOENIGSHOFFEN"]
["SOCIETE DE GYMNASTIQUE MASEVAUX","01068.039","S.G. MASEVAUX","ALSACE","HAUT RHIN","MASEVAUX"]
["SOCIETE DE GYMNASTIQUE SAUSHEIM","01068.054","S.G. SAUSHEIM","ALSACE","HAUT RHIN","SAUSHEIM"]
["EAST FRANCE TEAMGYM","01068.154",null,"ALSACE","HAUT RHIN","RIBEAUVILLE"]
["L'UNION SPORTIVE TALENCAISE","02033.004","L'US TALENCE","AQUITAINE","GIRONDE","TALENCE"]
["LE STADE PESSACAIS UNION CLUB","02033.005","SPUC PESSAC","AQUITAINE","GIRONDE","PESSAC"]
["LA VAILLANTE DE LANGON","02033.006","LA V. LANGON","AQUITAINE","GIRONDE","LANGON"]
["LES JEUNES DU CAPTALAT LA TESTE","02033.009","JC LA TESTE","AQUITAINE","GIRONDE","LA TESTE"]
["ASSOCIATION SPORTIVE ET CULTURELLE PESSAC ALOUETTE","02033.010","ASCPA PESSAC","AQUITAINE","GIRONDE","PESSAC ALOUETTE"]
["ENTENTE SPORTIVE DE BRUGES","02033.012","ES BRUGES","AQUITAINE","GIRONDE","BRUGES"]
["ASSOCIATION SPORTIVE LE HAILLAN GYM","02033.018","A.S LE HAILLAN GYM","AQUITAINE","GIRONDE","LE HAILLAN"]
["ASSOCIATION SPORTIVE ILLACAISE","02033.069","AS ILLACAISE","AQUITAINE","GIRONDE","ST JEAN D'ILLAC"]
["CLUB DEPARTEMENTAL DE GYMNASTIQUE GIRONDE","02033.074","CD GYM 33","AQUITAINE","GIRONDE","BORDEAUX"]
["ASSOCIATION SPORTIVE LOS SAUTAPRATS DE COARRAZE NAY","02064.123","AS LOS SAUTAPRATS COARRAZE NAY","AQUITAINE","PYRENEES ATLANTIQUES","NAY"]
["LA BELLERIVOISE","03003.024","LA BELLERIVOISE","AUVERGNE","ALLIER","BELLERIVE SUR ALLIER"]
["LA FRANCAISE","03003.026","LA FRANCAISE","AUVERGNE","ALLIER","CUSSET"]
["ILETS SPORTS MONTLUCONNAIS","03003.031","ILETS SPORTS MONTLUCONNAIS","AUVERGNE","ALLIER","MONTLUÇON"]
["LA BOURBONNAISE","03003.032","LA BOURBONNAISE","AUVERGNE","ALLIER","MOULINS"]
["ESPERANCE ST-GERMANOISE","03003.053","ESPERANCE ST-GERMANOISE","AUVERGNE","ALLIER","ST GERMAIN DES FOSSÉS"]
{"$rows_left_out":172}
{"sheet":"liste","index":14,"n_rows":21,"n_cols":12,"rows_kept":21,"hidden":true}
[]
["Découverte",1,null,"Top7","Junior",1]
["Evolution",1,"Adulte","Loisir1","Senior",2,null,"Découverte","Evolution","Détente","Passion","Europe"]
["Détente",2,"Féminine","Loisir2",null,3,null,"Féminine","Féminine","Féminine","Unique","Féminine"]
["Passion",2,"Masc/Mix",null,null,4,null,"Masc/Mix","Masc/Mix","Masc/Mix",null,"Masculine"]
["Europe",2,"Unique",{"$nulls":4},"Adulte","Adulte",null,null,"Mixte"]
[null,3]
[null,3,null,null,{"$f":"INDIRECT(A2)","v":{"$error":"#VALUE!"}}]
[null,3,"Féminine"]
[null,4,"Masculine"]
["Catégorie",5,"Mixte"]
["Découverte"]
["Evolution"]
["Détente"]
["Passion"]
[]
[]
[null,null,1]
[null,null,2]
[null,null,3]
{"$rows_left_out":2}
{"sheet":"Activer Macro 97-2003","index":15,"n_rows":71,"n_cols":1,"rows_kept":71}
["pour activer les macros :"]
[]
["en résumé : menu Excel ->"]
["Outils > Macros > Sécurité > cocher niveau sécurité moyen"]
[]
["en images:"]
{"$rows_empty":32}
[-2]
{"$rows_empty":19}
["(3) important : fermer le fichier, puis l'ouvrir à nouveau et cliquer \"Activer les Macros\" à la question suivante"]
{"$rows_empty":8}
["= mise en garde de Microsoft à ne pas négliger :"]
["Les macros peuvent contenir des virus. Il est généralement plus prudent de les désactiver. Toutefois, si elles proviennent d'une source sûre, le fait de les désactiver vous empêchera d'avoir accès à toutes les fonctionnalités. "]
[]
["les macros sont activées !"]

{"sheet":"Activer Macro2007","index":16,"n_rows":30,"n_cols":2,"rows_kept":30}
{"$rows_empty":29}
[null,"fermer le fichier, puis l'ouvrir à nouveau "]

{"sheet":"SOL Explications","index":17,"n_rows":22,"n_cols":9,"rows_kept":22,"merged":[[0,1,0,11],[1,1,1,11],[2,1,2,11],[17,1,18,4],[17,8,18,11],[21,5,28,7]]}
[null,"FEUILLES DE DIFF SOL - \n"]
[null,"La feuille a été modifiée pour que les juges de composition voit les données pour mieux juger. Sur cette page vous avez tout pour construire votre sol."]
[null,"Sélectionnez les objets et déplacez les sur les carrés blancs pour contruire votre formation et/ou indiquez les exigences de composition."]
{"$rows_empty":14}
[null,"FEDERAL",{"$nulls":6},"PERFORMANCE"]
[]
[]
[]
[{"$nulls":5},"Ce sont des listes, il faut choisir saut/pivots/maintien sur chaque formation"]

{"sheet":"Explications","index":18,"n_rows":49,"n_cols":4,"rows_kept":49,"merged":[[1,3,2,9],[3,3,3,9],[5,1,5,10],[6,1,6,10],[7,1,7,11],[8,1,8,11],[9,1,9,10],[10,1,10,10],[12,1,12,10],[14,1,14,10],[16,1,16,10],[17,1,17,10],[19,1,19,10],[21,1,21,10],[22,1,22,10],[23,1,23,10],[24,1,24,10],[25,1,25,10],[26,1,26,10],[29,1,29,10],[33,1,33,10],[34,1,34,10],[36,1,36,10],[41,1,41,10],[43,1,43,10],[44,1,44,10]]}
[]
[{"$nulls":3},"FEUILLES DE DIFF - MODE D'EMPLOI"]
[]
[{"$nulls":3},"V1.0"]
[]
[null,"Cet onglet permet de vous expliquer chaque étape de cet outil. "]
[null,"Comment activer les macros"]
[null,"Allez sur les onglets en fonction de votre version, ou regardez sur internet"]
[]
[null,"Explication des onglets"]
{"$rows_empty":31}
[null,"Utilisation de MAV"]
[null,"N'enregistrez pas le fichier au format par défaut, forcez le au format excel (.xlsm per ex)"]
[]
[null,"Un problème  : teamgymhelp@gmail.com"]
[null,"Une adresse de support a été créée afin de vous permettre d'envoyer les problèmes que vous rencontrerez:"]
[null,"Si vous rencontrez un problème envoyez un mail à cette adresse, en expliquant le problème que vous rencontrez, la saisie et les actions que vous avez effectuées. "]
[null,"Vous pouvez joindre aussi le fichier qui pose problème en précisant la version excel que vous utilisez."]
[null,"Plus vous serez explicite dans la description du problème, plus nous serons à même de vous aider."]

{"sheet":"fiche engagement","index":19,"n_rows":46,"n_cols":8,"rows_kept":46,"merged":[[0,0,0,5],[1,0,1,5],[2,0,2,5],[3,0,3,5],[4,0,4,5],[5,0,5,5],[6,0,6,1],[6,2,6,3],[8,0,8,1],[10,0,10,1],[12,2,14,4],[15,0,15,1],[15,2,15,4],[17,1,17,4],[19,2,19,4],[21,1,21,4],[23,3,23,4],[27,1,29,1],[27,2,29,2],[27,3,29,3],[27,4,29,4],[27,5,29,5]]}
["Fiche d'engagement Compétition TeamGym - SAISON 2018 - 2019 V1.0"]
["ENGAGEMENT EN LIGNE AU FORMAT EXCEL - PAS DE PDF/SCAN"]
["Remplir une feuille par équipe de compétition et remplissez toutes les cases."]
["Les cases grises sont des listes déroulantes."]
["Les cases bleues sont des zones de texte à compléter"]
["Les cases roses sont remplies automatiquement"]
["Help",null,"teamgymhelp@gmail.com"]
[]
["Catégories:",null,null,"Finale:"]
[]
["Section:",null,null,"Equipe numéro :"]
[]
[]
[]
["Nom de l'association :"]
["Code Informatique:",null,{"$f":"IF(H16=0,\" \",INDEX('FFGym Clubs'!C3:C257,H16))","v":" "},{"$nulls":4},{"$f":"SUM(('FFGym Clubs'!A2:A257=$C$13)*('FFGym Clubs'!B2:B257))","v":0}]
[]
["Ville :",{"$f":"IF(H16=0,\" \",INDEX('FFGym Clubs'!D3:D257,'fiche engagement'!H16))","v":" "}]
[]
["Correspondant Nom/Prénom :"]
{"$rows_left_out":27}
{"sheet":"FED Dif Sol","index":20,"n_rows":17,"n_cols":18,"rows_kept":17,"merged":[[0,4,1,6],[0,7,1,7],[0,8,1,9],[0,10,1,15],[1,17,1,19],[2,1,2,3],[2,4,2,6],[2,7,2,9],[2,10,2,12],[2,13,2,15],[3,1,3,3],[3,4,3,6],[3,7,3,9],[3,10,3,12],[3,13,3,15],[4,0,6,0],[5,17,5,19],[7,1,7,3],[7,4,7,6],[7,7,7,9],[7,10,7,12],[7,13,7,15],[8,1,8,3],[8,4,8,6],[8,7,8,9],[8,10,8,12],[8,13,8,15],[9,0,11,0],[12,1,12,3],[12,4,12,6],[12,7,12,9],[12,10,12,12],[12,13,12,15],[13,1,13,3],[13,4,13,6],[13,7,13,9],[13,10,13,12],[13,13,13,15],[14,0,16,0]]}
[{"$nulls":4},"NOMBRE DE GYM:",null,null,{"$f":"COUNTA('fiche engagement'!B33:B44)","v":0},"Equipe:",null,{"$f":"CONCATENATE(INDEX('FFGym Clubs'!D3:D257,'fiche engagement'!H16),\" - Equipe N°\",'fiche engagement'!E11)","v":{"$error":"#VALUE!"}}]
[{"$nulls":16},{"$f":"'fiche engagement'!C9","v":0},"Exigences de composition"]
[null,"Formation",null,null,"Formation",null,null,"Formation",null,null,"Formation",null,null,"Formation"]
[]
["DIFF","SAUT","PIVOTS","MAINTIEN"]
[null,"TOUT","TOUT","TOUT",{"$nulls":13},"Gymnastes"]
[null,"Combinaison",null,null,"Combinaison",null,null,"Combinaison",null,null,"Combinaison",null,null,"Combinaison"]
[null,"Formation",null,null,"Formation",null,null,"Formation",null,null,"Formation",null,null,"Formation"]
[]
["DIFF"]
[]
[null,"Combinaison",null,null,"Combinaison",null,null,"Combinaison",null,null,"Combinaison",null,null,"Combinaison"]
[null,"Formation",null,null,"Formation",null,null,"Formation",null,null,"Formation",null,null,"Formation"]
[]
["DIFF"]
[]
[null,"Combinaison",null,null,"Combinaison",null,null,"Combinaison",null,null,"Combinaison",null,null,"Combinaison"]

{"sheet":"PERF Dif Sol","index":21,"n_rows":17,"n_cols":18,"rows_kept":17,"merged":[[0,4,1,6],[0,7,1,7],[0,8,1,9],[0,10,1,15],[1,17,1,19],[2,1,2,3],[2,4,2,6],[2,7,2,9],[2,10,2,12],[2,13,2,15],[3,1,3,3],[3,4,3,6],[3,7,3,9],[3,10,3,12],[3,13,3,15],[4,0,6,0],[5,17,5,19],[7,1,7,3],[7,4,7,6],[7,7,7,9],[7,10,7,12],[7,13,7,15],[8,1,8,3],[8,4,8,6],[8,7,8,9],[8,10,8,12],[8,13,8,15],[9,0,11,0],[12,1,12,3],[12,4,12,6],[12,7,12,9],[12,10,12,12],[12,13,12,15],[13,1,13,3],[13,4,13,6],[13,7,13,9],[13,10,13,12],[13,13,13,15],[14,0,16,0]]}
[{"$nulls":4},"NOMBRE DE GYM:",null,null,{"$f":"COUNTA('fiche engagement'!B33:B44)","v":0},"Equipe:",null,{"$f":"CONCATENATE(INDEX('FFGym Clubs'!D3:D257,'fiche engagement'!H16),\" - Equipe N°\",'fiche engagement'!E11)","v":{"$error":"#VALUE!"}}]
[{"$nulls":16},{"$f":"'fiche engagement'!C9","v":0},"Exigences de composition"]
[null,"Formation",null,null,"Formation",null,null,"Formation",null,null,"Formation",null,null,"Formation"]
[]
["DIFF","SAUT","PIVOTS","MAINTIENT"]
[null,"E de FORCE","TOUT","TOUT",{"$nulls":13},"Gymnastes"]
[null,"Combinaison","SAUT ou PIVOTS",null,"Combinaison",null,null,"Combinaison",null,null,"Combinaison",null,null,"Combinaison"]
[null,"Formation",null,null,"Formation",null,null,"Formation",null,null,"Formation",null,null,"Formation"]
[]
["DIFF"]
[]
[null,"Combinaison",null,null,"Combinaison",null,null,"Combinaison",null,null,"Combinaison",null,null,"Combinaison"]
[null,"Formation",null,null,"Formation",null,null,"Formation",null,null,"Formation",null,null,"Formation"]
[]
["DIFF"]
[]
[null,"Combinaison",null,null,"Combinaison",null,null,"Combinaison",null,null,"Combinaison",null,null,"Combinaison"]

{"sheet":"dif tumbling","index":22,"n_rows":41,"n_cols":14,"rows_kept":41,"merged":[[0,1,0,2],[1,1,1,2],[2,1,2,2],[3,1,3,2],[4,1,4,2],[5,1,5,2],[6,1,6,2],[7,1,7,2],[8,1,8,2],[9,1,9,2],[10,1,10,2],[11,1,11,2],[11,8,11,9],[12,1,12,2],[13,2,13,9],[15,2,15,8],[16,2,21,8],[22,2,22,8],[25,2,25,8],[26,2,26,8],[27,2,27,8],[28,2,28,8],[29,2,29,8],[30,2,30,8],[31,2,31,8],[34,2,34,8],[35,2,35,8],[36,2,36,8],[37,2,37,8],[38,2,38,8],[39,2,39,8],[40,2,40,8]]}
[null,"Difficultés",null,"Passion","Détente","Evolution","Découverte",{"$nulls":4},"Case option pour les series avant arriere"]
["Av","Roulade avant",{"$nulls":3},"0.3","0.5",{"$nulls":4},1,2,2]
["Avt  \nArr","Roue",null,null,"0.5","0.5",1]
["Arr","Roue pied pied",null,null,"0.5","0.5",1,{"$nulls":4},{"$f":"'fiche engagement'!C9","v":0}]
["Arr","Rondade",null,null,"0.5",1,"1.5"]
["Avt","Saut de mains",null,"0.3",1,"1.5",2,null,"1/2 vrille",0.2]
["Avt","Saut de mains un pied",null,"0.3",1,"1.5",2,"TOTAL","carpé",0.1]
["Avt","Flip avant",null,"0.7","1.2",null,null,"DIFF / 6","tendu",0.2]
["Arr","Flip arrière",null,"0.3",1,"1.5",2,{"$f":"(J23+J32+J41)","v":0},"double",1]
["Avt","Salto en avant",null,1,"1.4",2,null,null,"Salto salto",0.2]
["Arr","Salto en arrière",null,1,"1.4",2,null,null,"salto au départ",0.1]
["Avt","Saut de mains Salto",null,"1.5","1.6",null,null,"Catégorie:",{"$f":"CONCATENATE('fiche engagement'!C9,\" \", 'fiche engagement'!C11,\" \", 'fiche engagement'!E9)","v":"  "}]
["Avt","Flip avant Salto",null,"1.6","1.8"]
[null,"Equipe",{"$f":"CONCATENATE(INDEX('FFGym Clubs'!D3:D257,'fiche engagement'!H16),\" - Equipe N°\",'fiche engagement'!E11)","v":"FRANCONVILLE - Equipe N°"}]
[null,"1er Passage"]
["N°","Nom du gym",{"$nulls":7},"Valeur"]
[1]
[2]
[3]
[4]
{"$rows_left_out":22}
{"sheet":"dif mini tramp","index":23,"n_rows":41,"n_cols":14,"rows_kept":41,"merged":[[0,1,0,2],[1,1,1,2],[2,1,2,2],[3,1,3,2],[4,1,4,2],[5,1,5,2],[6,1,6,2],[6,8,6,9],[7,1,7,2],[8,1,8,2],[9,1,9,2],[10,1,10,2],[11,1,11,2],[12,1,12,2],[12,8,12,9],[13,2,13,9],[15,2,15,8],[16,2,21,8],[24,2,24,5],[24,6,24,8],[25,2,25,8],[26,2,26,8],[27,2,27,8],[28,2,28,8],[29,2,29,8],[30,2,30,8],[33,2,33,5],[33,6,33,8],[34,2,34,8],[35,2,35,8],[36,2,36,8],[37,2,37,8],[38,2,38,8],[39,2,39,8]]}
[null,"Difficulté",null,"Passion","Détente","Evolution","Découverte"]
[null,"Saut pose de pieds + saut droit",{"$nulls":9},1,2,2]
[null,"Roue/Rondade"]
[null,"Rondade",null,"0.5",1,{"$nulls":6},{"$f":"'fiche engagement'!$C$9","v":0}]
[null,"Lune",null,1,"1.6"]
[null,"Rondade demi -Pétrick",null,"0.7","1.2"]
[null,"Lune vrille",null,"1.6",2,{"$nulls":3},"Valorisation"]
[null,"Tsukahara",null,"1.6",{"$nulls":3},"TOTAL","1/2 vrille",0.2]
[null,"Lune salto",null,"1.8",{"$nulls":3},"DIFF / 6","carpé",0.1]
[null,"Saut droit",{"$nulls":3},1,"1.2",{"$f":"J23+J32+J41","v":0},"tendu",0.2]
[null,"Saut groupé",{"$nulls":3},1,"1.5",null,"double",1]
[null,"Saut écart carpé",null,null,1,"1.3","1.8"]
[null,"Salto",null,1,"1.4","1.8",2,"Catégorie ",{"$f":"CONCATENATE('fiche engagement'!C9,\" \", 'fiche engagement'!C11,\" \", 'fiche engagement'!E9)","v":"  "}]
[null,"Equipe ",{"$f":"CONCATENATE(INDEX('FFGym Clubs'!D3:D257,'fiche engagement'!H16),\" - Equipe N°\",'fiche engagement'!E11)","v":"FRANCONVILLE - Equipe N°"}]
[null,"1er Passage"]
["N°","Nom du gym"]
[1]
[2]
[3]
[4]
{"$rows_left_out":21}